{"text_format":"1","workbook":"xlsx","n_sheets":10,"sheets":["C","S","L","Control","Caracteristicas tecnicas","Dimensionado","Costos unitarios","Costeo","Precio","Servicios complementarios"],"not_rendered":{"charts":0,"images":1,"macros":1,"external_links":0,"defined_names":214,"comments":2,"pivot_tables":0},"unopened":[],"bounds":{"document_bytes":16777216,"sheet_cells":100000,"rows_first":2000,"rows_last":500,"rows_between":2000,"halvings":0,"cell_chars":16384,"cell_head_chars":4096},"cells_cut":0,"cells_raw":0,"read":"whole","date_system":"1900"}

{"sheet":"C","index":0,"n_rows":16,"n_cols":3,"rows_kept":16,"cut":false,"hidden":false,"merged":[]}
[null,null,{"$f":"Workbook.Title","v":"Analysys Mason - Modelo de costos coubicacion fija"}]
[]
["Información"]
[]
["Título","Analysys Mason - Modelo de costos coubicacion fija"]
["Objectivo","Determinar precios orientados a costos para el servicio de coubicación fija en la infraestructura pasiva fija del AEP"]
[]
["Versión","2 de noviembre 2016"]
["Estatus","Approved for release"]
[null,"Under construction"]
[null,"Work in progress"]
[null,"Ready for review"]
[null,"Approved for release"]
["Autor","Guillermo Fernández Castellanos, David de Antonio Monte"]
["Email","guillermo.fernandez@analysysmason.com"]
[null,"david.de.antonio@analysysmason.com"]

{"sheet":"S","index":1,"n_rows":140,"n_cols":10,"rows_kept":140,"cut":false,"hidden":false,"merged":[]}
[null,null,"Style Guidelines"]
[]
[]
[]
[]
["Input cell styles"]
["Use these styles to identify inputs to a model"]
["NB These styles change most aspects of a cells formatting (all except Number and Alignment)"]
[]
[null,"Input Parameter",100,"unlocked","An input to the model that it is expected the user will change (change at will)"]
[]
[null,"Input Parameter",250,"unlocked","Consider using Data Validation to ensure that only acceptable values are entered"]
[null,"Minimum",100]
[null,"Maximum",300]
[]
[null,"Input Parameter",300,"unlocked","If a parameter can take only one of a small number of values, consider using Data Validation Allow List with In-cell dropdown selected"]
[null,"Acceptable values",100]
[null,null,200]
[null,null,300]
[]
{"$rows_left_out":121}
{"sheet":"L","index":2,"n_rows":118,"n_cols":14,"rows_kept":118,"cut":false,"hidden":false,"merged":[]}
[" ",null,"Listas utilizadas en el modelo"]
[]
[null,null,"Hundred, thousand, million"]
[null,null,100,"hundred"]
[null,null,1000,"thousand"]
[null,null,1000000,"million"]
[]
[null,null,"Spare, void and not available"]
[null,null,"espacio vacante","spare"]
[null,null,"void","void"]
[null,null,"N/A","not.available"]
[]
[null,null,"TRUE, FALSE"]
[null,null,true]
[null,null,false]
[null,null,"true.false"]
[]
[null,null,"Lista de activos",null,"Componentes de central de Telmex",null,null,null,"Categorias tamaño de central de Telmex (bluces de abonado)","MIN","MAX","Avg",null,"Componentes del predio"]
[null,1,"Predio",1,"Sala MDF/ODF AEP",null,null,1,"Pequeña",0,499,{"$f":"ROUND(AVERAGE(J19:K19),)","v":250},1,"Area caseta central"]
[null,2,"Central del AEP",2,"Sala coubicación CS",null,null,2,"Media",{"$f":"K19+1","v":500},1499,{"$f":"ROUND(AVERAGE(J20:K20),)","v":1000},2,"Area sala coubicacion externa"]
{"$rows_left_out":99}
{"sheet":"Control","index":3,"n_rows":137,"n_cols":13,"rows_kept":137,"cut":false,"hidden":false,"merged":[[2,4,2,5]]}
["Panel de control",null,null,null,null,null,null,null,null,null,null,null," "]
[]
[null,null,null,"CHECK de los parametros eligidos",{"$f":"IF(AND(H78=ok,H80=ok,K84=ok,H81=ok,H69=ok,H70=ok,H71=ok,H74=ok),ok,actualizar.seleccion)","v":"OK"}]
[]
[null,null,null,"Elemento","Unidad","Valor","Nombre 1","Check / Indices","Nombre 2",null,"Notas"]
[]
["Resultados"]
[null,"Contraprestacion mensual por CS"]
[]
[null,null,"Coubicacion cerrada",null,null,"Contraprestación mensual"]
[null,null,null,{"$f":"\"Zona \"&geotipo.activo&\", \"&tipo.coubicacion.activo&\" , \"&IF(solicitacion.fuente.energia.respaldo.activo.CS=TRUE,\"con respaldo\", \"sin respaldo\")","v":"Zona Media, Cerrada , con respaldo"},"m2",{"$f":"IF(tipo.coubicacion.activo<>\"Cerrada\",0,Precio!J195/espacio.coubicacion.cerrada/12)","v":962.19497049621452},"output.coubicacion.cerrada"]
[]
[null,null,"Coubicacion basica",null,null,"Contraprestación mensual"]
[null,null,null,{"$f":"\"Zona \"&geotipo.activo&\", \"&tipo.coubicacion.activo&\" , \"&IF(solicitacion.fuente.energia.respaldo.activo.CS=TRUE,\"con respaldo\", \"sin respaldo\")","v":"Zona Media, Cerrada , con respaldo"},"20 m2",{"$f":"IF(tipo.coubicacion.activo<>\"Basica\",0,Precio!J195/espacio.coubicacion.basica/12)*20","v":0},"output.coubicacion.basica"]
[]
[null,null,"Coubicacion equipada",null,null,"Contraprestación mensual"]
[null,null,null,{"$f":"\"Zona \"&geotipo.activo&\", \"&tipo.coubicacion.activo&\" , \"&IF(solicitacion.fuente.energia.respaldo.activo.CS=TRUE,\"con respaldo\", \"sin respaldo\")","v":"Zona Media, Cerrada , con respaldo"},"por rack",{"$f":"IF(tipo.coubicacion.activo<>\"Equipada\",0,Precio!J195/F38/12)","v":0},"output.coubicacion.equipada"]
[]
["Control"]
[null,"Tipo de coubicacion"]
{"$rows_left_out":118}
{"sheet":"Caracteristicas tecnicas","index":4,"n_rows":111,"n_cols":17,"rows_kept":111,"cut":false,"hidden":false,"merged":[[60,3,60,4],[107,3,107,4]]}
["Caracteristicas tecnicas"]
[]
["Dimensionado de las salas",null,"Unidad",null,null,null,null,"Nombre","Fuente / Notas","Notas"]
[null,null,null,null,2.5,2,1.5]
[null,null,null,{"$f":"TRANSPOSE(tamaño.central.Telmex)","v":"Pequeña"},"Media","Grande","Muy grande","calculos.secundarios.tamano.caseta"]
[null,"Sala MDF/ODF AEP","m2",{"$f":"D22","v":13.673999999999999},14.447999999999999,16.77,22.962,"calculos.secundarios.Sala MDF"]
[null,"Sala de control","m2",10,10,15,15,"calculos.secundarios.Sala de control"]
[null,"Sala de switching / DSLAM del AEP","m2",{"$f":"D30","v":15.959999999999999},20.52,29.639999999999997,38.76,"calculos.secundarios.Sala de switching del AEP"]
[null,"Sala equipos de transmisión del AEP","m2",{"$f":"D8","v":15.959999999999999},20.52,29.639999999999997,38.76,"calculos.secundarios.Sala equipos de transmisión del AEP"]
[]
[]
[null,"Estimacion bottom-up del tamaño de la sala MDF"]
[null,"Blucles promedio entrantes en la central","#",{"$f":"TRANSPOSE(L!L19:L22)","v":250},1000,3250,10000]
[null,"Overhead para dimensionamiento MDF","%",0.5,0.5,0.5,0.5,null,"Fuente: Politecnico di Torino / Telecom Italia"]
[null,"Bucles para dimensionamiento de MDF","#",{"$f":"D13*(1+D14)","v":375},{"$f":"E13*(1+E14)","v":1500},4875,15000]
[null,"Espacio ocupado por un modulo MDF para 800 bucles","bucles",800,{"$f":"D16","v":800},800,800,null,"Fuente: Politecnico di Torino / Telecom Italia"]
[null,"Ancho","m",0.18,{"$f":"D17","v":0.18},0.18,0.18,"(a)"]
[null,"Produndidad","m",1.3,{"$f":"D18","v":1.3},{"$f":"E18","v":1.3},1.3,"(p)"]
[null,"Numero minimo de modulos","#",1,{"$f":"D19","v":1},1,1]
[null,"Numero de modulos requeridos","#",{"$f":"MAX(D19,ROUNDUP(D13/D16,))","v":1},{"$f":"MAX(E19,ROUNDUP(E13/E16,))","v":2},{"$f":"MAX(F19,ROUNDUP(F13/F16,))","v":5},{"$f":"MAX(G19,ROUNDUP(G13/G16,))","v":13},"(n)"]
{"$rows_left_out":92}
{"sheet":"Dimensionado","index":5,"n_rows":104,"n_cols":12,"rows_kept":104,"cut":false,"hidden":false,"merged":[]}
["Dimensionado",null,null,null,null,null,null,null,null,null,null," "]
[]
[null,null,null,"Elemento","Unidad","Valor","Nombre",null,"Notas"]
[]
["Uso de Sitios, Predios y Espacios Físicos"]
[1,{"$f":"INDEX(lista.activos,$A6)","v":"Predio"}]
[]
[null,null,null,"Área ocupada","m2",{"$f":"area.exterior.central.telmex+area.sala.coubicacion.externa.CS","v":76.233764578947373},"area.ocupada.predio"]
[null,null,null,"Mark-up para área total","%",{"$f":"markup.predio*predio.activo","v":0.5}]
[null,null,null,"Mark-up zona rural","%",{"$f":"markup.zona.rural","v":0}]
[null,null,null,"Área total","m2",{"$f":"F8*(1+F9)*(1+F10)","v":114.35064686842105},"area.total.predio"]
[]
[2,{"$f":"INDEX(lista.activos,$A13)","v":"Central del AEP"}]
[]
[null,null,null,"Área de las salas","m2",{"$f":"(area.sala.MDF.AEP+area.sala.coubicacion.CS+area.sala.control+area.sala.switching+area.sala.transmision+area.sala.subestacion.electrica+area.sala.emergencia+area.sala.baterias+area.espacio.overheads)","v":152.46752915789475},"area.salas.central.telmex"]
[null,null,null,"Área exterior caseta central","m2",{"$f":"area.salas.central.telmex*(1+markup.area.exterior.central.telmex)/numero.plantas.central.telmex.activo","v":76.233764578947373},"area.exterior.central.telmex",null,"Nota: La area exterior de la central de Telmex es la suma de la area de las salas, didivido por el numero de pisos, multiplicado por un mark-up (para se considerar las areas comunes y de construccion)"]
[]
[null,1,{"$f":"INDEX(lista.componentes.central.telmex,$B18)","v":"Sala MDF/ODF AEP"}]
[]
[null,null,null,"Sala MDF/ODF AEP","m2",{"$f":"INDEX(calculos.secundarios.Sala_MDF,MATCH(tipo.central.telmex.activa,calculos.secundarios.tamano.caseta,0))","v":14.447999999999999},"area.sala.MDF.AEP"]
{"$rows_left_out":85}
{"sheet":"Costos unitarios","index":6,"n_rows":101,"n_cols":27,"rows_kept":101,"cut":false,"hidden":false,"merged":[[3,26,4,26],[3,13,4,19],[3,6,4,11],[3,21,4,24]]}
["Costos unitarios",null,null,null,null,null,null,null,null," "]
[]
[null,"Año de referencia",2015]
[null,"Año activo",{"$f":"año.activo","v":2017},null,null,null,"CAPEX",null,null,null,null,null,null,"OPEX",null,null,null,null,null,null,null,"VIDA UTIL",null,null,null,null,"NOTAS"]
[null,null,{"$f":"C4-C3","v":2}]
[]
["Uso de Sitios, Predios y Espacios Físicos"]
[1,{"$f":"INDEX(lista.activos,$A8)","v":"Predio"}]
[null,null,"Propiedad del predio","Geotipo del predio","Identificador",null,"CAPEX unitario obras civiles de adecuacion (MXN/m2)","Tendencia de costos","CAPEX unitario obras civiles de adecuacion (MXN/m2) - Año activo","CAPEX unitario de adquisicion (MXN/m2)","Tendencia de costos","CAPEX unitario de adquisicion (MXN/m2) - Año activo",null,"OPEX anual alquiler (MXN/año)","Tendencia de costos","OPEX anual alquiler (MXN/año/m2) - Año activo","OPEX de mantenimiento (MXN/año/m2)","Tendencia de costos","OPEX de mantenimiento (% capex)","OPEX de mantenimiento (MXN/año/m2)  - Año activo",null,"Vida util economica","Vida util contable","Vida util activa","Vida util restante"]
[null,null,"Telmex","Alta",{"$f":"C10&D10","v":"TelmexAlta"}," ",525,0.05,{"$f":"G10*(1+H10)^$C$5","v":578.8125},8240,0.03,{"$f":"J10*(1+K10)^$C$5","v":8741.8159999999989},null,0,0.03,{"$f":"N10*(1+O10)^$C$5","v":0},{"$f":"(G10+J10)*S10","v":0},0.03,0,{"$f":"Q10*(1+R10)^$C$5","v":0},null,80,80,{"$f":"CHOOSE(vida.util.activo.indice,'Costos unitarios'!V10,'Costos unitarios'!W10)","v":80},{"$f":"MAX(0,X10-$C$5)","v":78}]
[null,null,"Telmex","Media",{"$f":"C11&D11","v":"TelmexMedia"}," ",578,0.05,{"$f":"G11*(1+H11)^$C$5","v":637.245},8240,0.03,{"$f":"J11*(1+K11)^$C$5","v":8741.8159999999989},null,0,0.03,{"$f":"N11*(1+O11)^$C$5","v":0},{"$f":"(G11+J11)*S11","v":0},0.03,0,{"$f":"Q11*(1+R11)^$C$5","v":0},null,{"$f":"$V$10","v":80},{"$f":"$W$10","v":80},{"$f":"$X$10","v":80},{"$f":"MAX(0,X11-$C$5)","v":78}]
[null,null,"Telmex","Baja","TelmexBaja"," ",630,0.05,694.57500000000005,8240,0.03,8741.8159999999989,null,0,0.03,0,0,0.03,0,0,null,{"$f":"$V$10","v":80},{"$f":"$W$10","v":80},{"$f":"$X$10","v":80},78]
[null,null,"Telmex","espacio vacante","Telmexespacio vacante"," ",null,null,0,null,null,0,null,null,null,0,0,null,null,0,null,null,null,null,0]
[null,null,"Tercero en arrendamiento","Alta","Tercero en arrendamientoAlta"," ",525,0.05,578.8125,0,0.03,0,null,0,0.03,0,0,0.03,0,0,null,80,80,80,78]
[null,null,"Tercero en arrendamiento","Media","Tercero en arrendamientoMedia"," ",578,0.05,637.245,0,0.03,0,null,0,0.03,0,0,0.03,0,0,null,80,80,80,78]
[null,null,"Tercero en arrendamiento","Baja","Tercero en arrendamientoBaja"," ",630,0.05,694.57500000000005,0,0.03,0,null,0,0.03,0,0,0.03,0,0,null,80,80,80,78]
[null,null,"Tercero en arrendamiento","espacio vacante","Tercero en arrendamientoespacio vacante"," ",null,null,0,null,null,0,null,null,null,0,0,null,null,0,null,null,null,null,0]
[null,null,"Tercero en comodato","Alta","Tercero en comodatoAlta"," ",525,0.05,578.8125,0,0.03,0,null,0,0.03,0,0,0.03,0,0,null,80,80,80,78]
[null,null,"Tercero en comodato","Media","Tercero en comodatoMedia"," ",578,0.05,637.245,0,0.03,0,null,0,0.03,0,0,0.03,0,0,null,80,80,80,78]
[null,null,"Tercero en comodato","Baja","Tercero en comodatoBaja"," ",630,0.05,694.57500000000005,0,0.03,0,null,0,0.03,0,0,0.03,0,0,null,80,80,80,78]
{"$rows_left_out":82}
{"sheet":"Costeo","index":7,"n_rows":37,"n_cols":29,"rows_kept":37,"cut":false,"hidden":false,"merged":[[2,23,3,25],[2,17,3,21],[2,8,3,15]]}
["Costeo"]
[]
[null,null,null,null,null,null,null,null,"CAPEX",null,null,null,null,null,null,null,null,"OPEX",null,null,null,null,null,"Costos totales incluindo overheads"]
[]
[null,null,null,null,null,null,null,null,null,"Inputs",null,null,null,null,null,null,null," "]
[null,null,null,"Elemento","Unidad","Cantidad","Nombre",null,"Unidad capex unitario","Obras civiles","Unidad capex unitario","Adquisicion","Capex total","Vida útil","Vida útil restante","Anualidad Capex",null,"Unidad opex unitario 1","Alquiler","Unidad opex unitario 2","Mantenimiento","Opex total",null,"Capex total","Opex total","Gasto anual",null,"Notas"]
["Unidad -->",null,null,null,null,null,null,null,null,"MXN",null,"MXN","MXN","años","años","MXN/año",null,null,"MXN",null,"MXN","MXN/año",null,"MXN/año","MXN/año","MXN/año"]
[]
["Uso de Sitios, Predios y Espacios Físicos"]
[1,{"$f":"INDEX(lista.activos,$A10)","v":"Predio"}]
[]
[null,null,null,{"$f":"id.predio.activo","v":"Tercero en arrendamientoMedia"},"m2",{"$f":"area.total.predio","v":114.35064686842105},null,null,"MXN/m2",{"$f":"INDEX(capex.unitario.obras.adecuacion.predio,MATCH(D12,identificador.predio,0))","v":637.245},"MXN/m2",{"$f":"INDEX(capex.unitario.acquisicion.predio,MATCH(D12,identificador.predio,0))","v":0},{"$f":"(F12*J12)+(F12*L12)","v":72869.377963666979},{"$f":"INDEX(vida.util.predio,MATCH(D12,identificador.predio,0))","v":80},{"$f":"INDEX(vida.util.restante.predio,MATCH(D12,identificador.predio,0))","v":78},{"$f":"(wacc/(1-(1/(1+wacc)^N12)))*M12","v":7225.1212538323398},null,"MXN",{"$f":"INDEX(opex.anual.alquiler.predio,MATCH(D12,identificador.predio,0))","v":0},"MXN/m2",{"$f":"INDEX(opex.anual.mantenimiento.predio,MATCH(D12,identificador.predio,0))","v":0},{"$f":"S12+(U12*F12)","v":0},null,{"$f":"P12*(1+markup.overhead.capex)","v":7803.1309541389273},{"$f":"V12*(1+markup.overhead.opex)","v":0},{"$f":"X12+Y12","v":7803.1309541389273}]
[null,null,null,null,null,null,null,null,null,null,null,null,null,null,null,null,null,null,null,null,null,null,null,"capex.predio","opex.predio","gasto.anual.predio"]
[2,{"$f":"INDEX(lista.activos,$A14)","v":"Central del AEP"},null,null,null,null,null,null,null,null,null,null,null,null,null,null,null,null,null,null,null,null,null,null,null,null,null,"Output para el modelo móvil"]
[]
[null,null,null,{"$f":"id.central.telmex.activo","v":"MediaMedia"},"m2",{"$f":"area.salas.central.telmex","v":152.46752915789475},null,null,"MXN/m2",{"$f":"INDEX(capex.unitario.central.telmex,MATCH(D16,identificador.central.telmex,0))","v":14990.517},0,0,{"$f":"(J16*F16)","v":2285567.0877894168},{"$f":"INDEX(vida.util.central.telmex,MATCH(D16,identificador.central.telmex,0))","v":70},{"$f":"INDEX(vida.util.restante.central.telmex,MATCH(D16,identificador.central.telmex,0))","v":68},{"$f":"(wacc/(1-(1/(1+wacc)^N16)))*M16","v":226803.81898152668},null,"MXN",{"$f":"INDEX(opex.anual.alquiler.central.telmex,MATCH(D16,identificador.central.telmex,0))","v":103384.70621258792},"MXN",{"$f":"INDEX(opex.anual.mantenimiento.central.telmex,MATCH(D16,identificador.central.telmex,0))","v":159467.6771568121},{"$f":"S16+U16","v":262852.38336940005},null,{"$f":"P16*(1+markup.overhead.capex)","v":244948.12450004884},{"$f":"V16*(1+markup.overhead.opex)","v":283880.57403895207},{"$f":"X16+Y16","v":528828.69853900094},null,{"$f":"capex.central.telmex/F16","v":1606.5592841501457},{"$f":"opex.central.telmex/F16","v":1861.9084050674587}]
[null,null,null,null,null,null,null,null,null,null,null,null,null,null,null,null,null,null,null,null,null,null,null,"capex.central.telmex","opex.central.telmex","gasto.anual.central.telmex",null,"capex.central.telmex.para.movil","opex.central.telmex.para.movil"]
[3,{"$f":"INDEX(lista.activos,$A18)","v":"Sala coubicación externa"}]
[]
[null,null,null,{"$f":"id.central.telmex.activo","v":"MediaMedia"},"m2",{"$f":"area.sala.coubicacion.externa.CS","v":0},null,null,"MXN/m2",{"$f":"INDEX(capex.unitario.sala.coubicacion.externa,MATCH(D20,identificador.sala.coubicacion.externa,0))","v":14990.517},0,0,{"$f":"(J20*F20)","v":0},{"$f":"INDEX(vida.util.sala.coubicacion.externa,MATCH(D20,identificador.central.telmex,0))","v":70},{"$f":"INDEX(vida.util.restante.sala.coubicacion.externa,MATCH(D20,identificador.central.telmex,0))","v":68},{"$f":"(wacc/(1-(1/(1+wacc)^N20)))*M20","v":0},null,"MXN",{"$f":"INDEX(opex.anual.alquiler.sala.coubicacion.externa,MATCH(D20,identificador.sala.coubicacion.externa,0))","v":0},"MXN",{"$f":"INDEX(opex.anual.mantenimiento.sala.coubicacion.externa,MATCH(D20,identificador.sala.coubicacion.externa,0))","v":0},{"$f":"S20+U20","v":0},null,{"$f":"P20*(1+markup.overhead.capex)","v":0},{"$f":"V20*(1+markup.overhead.opex)","v":0},{"$f":"X20+Y20","v":0}]
{"$rows_left_out":18}
{"sheet":"Precio","index":8,"n_rows":199,"n_cols":18,"rows_kept":199,"cut":false,"hidden":false,"merged":[]}
["Precio",null,null,null,null,null,null,null,null,null,null,null,null," "]
[]
[]
[]
["Matrices de mapeo de elementos de red a servicios"]
[null,null,"AEP",null,null,"Servicios  -->",null,{"$f":"TRANSPOSE(lista.servicios)","v":"Coubicación"},"Subestación electrica","Fuente de energia de respaldo","Aire acondicionado",null,"Nota: incluimos autoaprovisionamiento del AEP"]
[null,null,"Elemento"]
[null,1,{"$f":"INDEX(lista.activos,B8)","v":"Predio"},null,null,null,null,1,0,0,0]
[null,{"$f":"B8+1","v":2},"Central del AEP",null,null,null,null,{"$f":"((SUMPRODUCT(H$17:H$26,$H$116:$H$125)/SUM($H$116:$H$125)))*((1-$K9)/1)","v":0.61282873157364248},{"$f":"(SUMPRODUCT(I$17:I$26,$H$116:$H$125)/SUM($H$116:$H$125))*((1-$K9)/1)","v":0.27103767883064844},{"$f":"(SUMPRODUCT(J$17:J$26,$H$116:$H$125)/SUM($H$116:$H$125))*((1-$K9)/1)","v":6.6133589595708961E-2},0.05,null,"Nota: ver abajo asignación de salas a servicios"]
[null,{"$f":"B9+1","v":3},"Sala coubicación externa",null,null,null,null,1,0,0,0]
[null,4,"Subestación electrica",null,null,null,null,0,1,0,0]
[null,5,"Fuente de energia de respaldo (planta de emergencia)",null,null,null,null,0,0,1,0]
[null,6,"Aire acondicionado",null,null,null,null,0,0,0,1]
[null,7,{"$f":"INDEX(lista.activos,B14)","v":"Racks"},null,null,null,null,1,0,0,0]
[]
[null,null,"Sub-elemento de la Central del AEP"]
[null,1,{"$f":"INDEX(lista.componentes.central.telmex,B17)","v":"Sala MDF/ODF AEP"},null,null,null,null,1,0,0,0]
[null,{"$f":"B17+1","v":2},"Sala coubicación CS",null,null,null,null,1,0,0,0]
[null,{"$f":"B18+1","v":3},"Sala de control",null,null,null,null,1,0,0,0]
[null,{"$f":"B19+1","v":4},"Sala de switching del AEP",null,null,null,null,1,0,0,0]
{"$rows_left_out":180}
{"sheet":"Servicios complementarios","index":9,"n_rows":103,"n_cols":9,"rows_kept":103,"cut":false,"hidden":false,"merged":[]}
[null,null,null,"Servicios complementarios"]
[]
[null,null,null,"Elemento","Unidad","Valor","Nombre 1","Check / Indices","Nombre 2"]
[]
["Cobros no recurrentes"]
[]
["Gastos de instalación coubicación"]
[null,"Costos unitarios"]
[null,null,null,"Obra civil CI","MXN por m2",7113]
[null,null,null,"Obra civil CE","MXN por m2",16463]
[null,null,null,"Instalación Eléctrica","MXN por m2",2388]
[null,null,null,"Clima (Equipo)","MXN",22000]
[null,null,null,"Racks","MXN por unidad",6435]
[]
[null,"Output - Cobros no Recurrentes - Contraprestación Pago Único"]
[null,null,"Coubicacion Basica"]
[null,null,null,{"$f":"\"Gastos de instalación Co-ubicación \" & H17 & \"m2 Interna\"","v":"Gastos de instalación Co-ubicación 20m2 Interna"},"MXN",{"$f":"($F$9+$F$11)*H17+$F$12","v":212020},null,{"$f":"espacio.coubicacion.basica","v":20},"m2"]
[null,null,null,{"$f":"\"Gastos de instalación Co-ubicación \" & H18 & \"m2 Externa\"","v":"Gastos de instalación Co-ubicación 20m2 Externa"},"MXN",{"$f":"($F$10+$F$11)*H18+$F$12","v":399020},null,{"$f":"espacio.coubicacion.basica","v":20},"m2"]
[]
[null,null,"Coubicacion Equipada"]
{"$rows_left_out":83}